Py4JJavaError: An error occurred while calling z:org.apache.spark.api.python.PythonRDD.collectAndServe. : org.apache.spark.SparkException: Job aborted due to stage failure: Task 1 in stage 30.0 failed 1 times, most recent failure: Lost task 1.0 in stage 30.0 (TID 31, DESKTOP-VIB8TOB, executor driver): org.apache.spark.api.python.PythonException: Traceback (most recent call last):

Spark - Pyspark - when we run a function we can get this error



Spark - Pyspark içerisinde fonksiyon çalıştırırken karşılaşabileceğimiz bir hata olan

Py4JJavaError: An error occurred while calling z:org.apache.spark.api.python.PythonRDD.collectAndServe.
: org.apache.spark.SparkException: Job aborted due to stage failure: Task 1 in stage 30.0 failed 1 times, most recent failure: Lost task 1.0 in stage 30.0
(TID 31, DESKTOP-VIB8TOB, executor driver): org.apache.spark.api.python.PythonException: Traceback (most recent call last):


You get this error i recommend you to get your data. If you have any outline
thing for your data such as "...", null, blank..., you need to delete. Then you can continue.
Eğer böyle bir hata aldıysanıza verinizi kontrol etmenizi öneririm. Eğer blank, "..."
ya da null girdileriniz varsa bunları kaldırmanızı daha sonra kodunuzu tekrar çalıştırmanızı öneririm.

Yorumlar